patène
terme associe: T69-1136
terme associe: T69-1174
terme associe: T69-1471
terme associe: T69-1492
terme associe: T69-1551
terme associe: T69-2154
terme associe: T69-2240
terme associe: T69-2252
terme associe: T69-2580
created: 2012-05-16T00:00:00+02:00
modified: 2014-11-27T15:24:31+01:00
status: 1
type: Concept
alternative label: patène de viatique
broader: T69-1173
definition: Petit plat consacré, utilisé par le célébrant durant la messe, pour poser l'hostie avant et après la consécration ou pour en recueillir les parcelles. La patène, généralement en métal précieux, toujours dorée à l'intérieur, est de forme circulaire, avec un large marli ou un fond polylobé. Elle est souvent décorée, au revers, d'une représentation religieuse, d'une inscription ou de symboles eucharistiques. Le diamètre de son fond doit être, en principe, le même que celui de la coupe du calice avec lequel elle forme généralement un ensemble.
in scheme: T69
preferred label: patens (liturgical vessels) @en-us
preferred label: patena @it
related: T69-1136
related: T69-1174
related: T69-1471
related: T69-1492
related: T69-1551
related: T69-2154
related: T69-2240
related: T69-2252
related: T69-2580