pince à hostie
created: 2012-05-16T00:00:00+02:00
modified: 2014-11-27T15:25:25+01:00
status: 1
type: Concept
alternative label: manche à hostie
alternative label: pince eucharistique
alternative label: pince liturgique
broader: T69-1173
definition: Ustensile en métal constitué d'une pince plate ou d'un manche terminé par une spatule. Elle était autrefois utilisée pour prendre les hosties consacrées ou éventuellement les distribuer aux lépreux et autres malades contagieux.
in scheme: T69
preferred label: eucharistic tongs @en-us
preferred label: pinze eucharistiche @it
preferred label: pinça de hóstias @pt