plateau de communion
terme associe: T69-1444
terme associe: T69-2238
created: 2012-05-16T00:00:00+02:00
modified: 2014-11-27T15:31:41+01:00
status: 1
type: Concept
alternative label: patène de communion
broad match: Objets du culte catholique
broader: T69-1173
definition: Petit plat en argent ou en métal doré, souvent ovale, parfois rectangulaire ou en croissant, utilisé pour recueillir les parcelles d'hostie lors de la communion des fidèles. Il peut être muni d'une anse ou d'un manche.
in scheme: T69
preferred label: communion plates @en-us
preferred label: piattino da comunione @it
preferred label: salva de comunhão @pt
related: T69-1444
related: T69-2238