veilleuse du saint sacrement
created: 2012-05-16T00:00:00+02:00
modified: 2014-11-27T15:44:01+01:00
status: 1
type: Concept
broad match: cb11978573t
broader: T69-1173
definition: Lampe formant veilleuse, allumée en permanence pour marquer la présence divine dans le tabernacle. Elle peut être posée sur l'autel ou à proximité, parfois sur un pied avec lequel elle fait corps ou encore être suspendue à un bras d'applique sur un mur, au-dessus de l'autel. Elle contient généralement un récipient en verre de couleur rouge.
in scheme: T69
narrower: T69-1285
preferred label: sanctuary lamps @en-us
preferred label: lampada del SS. Sacramento @it
preferred label: lamparina do Santíssimo @pt