lampe de sanctuaire
created: 2012-05-16T00:00:00+02:00
modified: 2014-11-27T15:47:13+01:00
status: 1
type: Concept
alternative label: lampe du saint sacrement
broad match: Mobilier liturgique
broader: T69-1283
definition: Lampe formant veilleuse, suspendue en avant et non loin de l'autel, allumée en permanence pour marquer la présence divine dans le tabernacle. Elle se compose d'une coupe suspendue à des chaînes comportant un récipient à huile en verre, placé soit dans la coupe, soit dans une monture au-dessus d'elle.
in scheme: T69
preferred label: hanging sanctuary lamps @en-us
preferred label: lampada pensile del SS. Sacramento @it
preferred label: lâmpada do Santíssimo @pt