ampoule aux saintes huiles
terme associe: T69-1136
terme associe: T69-1319
terme associe: T69-686
created: 2012-05-16T00:00:00+02:00
modified: 2014-12-01T10:20:35+01:00
status: 1
type: Concept
alternative label: boîte à sainte huile
alternative label: chrémière
alternative label: flacon aux saintes huiles
broader: T69-1288
definition: Récipient couvert, en argent ou en étain, parfois doté d'une doublure en verre, contenant l'huile pour les onctions. En général au nombre de trois et assorties, les ampoules aux saintes huiles sont souvent identifiables par une inscription. Elles doivent être conservées dans une armoire spécifique, l'armoire aux saintes huiles.
in scheme: T69
narrower: T69-1293
narrower: T69-1298
narrower: T69-1303
preferred label: ampullae @en-us
preferred label: vasetti per oli santi @it
preferred label: ampolas dos Santos Oleos @pt
related: T69-1136
related: T69-1319
related: T69-686