ampoule à saint chrême
created: 2012-05-16T00:00:00+02:00
modified: 2014-12-01T10:29:10+01:00
status: 1
type: Concept
alternative label: boîte à saint chrême
broad match: http://vocab.getty.edu/aat/300198899
broader: T69-1289
definition: Récipient contenant le saint Chrême utilisé pour le baptême, la confirmation, la consécration des églises et des autels, l'ordination des prêtres, le sacre des évêques et la bénédiction des cloches des églises consacrées. Il porte l'inscription sanctum chrisma ou s.c.
in scheme: T69
preferred label: holy chrism ampullae @en-us
preferred label: vasetto per il Crisma @it
preferred label: ampola do Crisma @pt