garde-corps de balcon
terme associe: T69-60
created: 2012-05-16T00:00:00+02:00
modified: 2015-01-30T12:44:49+01:00
status: 1
type: Concept
alternative label: balconnet
broader: T69-132
definition: Ouvrage à hauteur d'appui formant protection devant un balcon.
in scheme: T69
preferred label: balcony railings @en-us
related: T69-60