garde-corps de tribune
terme associe: T69-81
created: 2012-05-16T00:00:00+02:00
modified: 2015-01-30T12:58:03+01:00
status: 1
type: Concept
broad match: cb13335478z
broader: T69-132
definition: Ouvrage à hauteur d'appui formant protection devant une tribune.
in scheme: T69
preferred label: tribune railings @en-us
related: T69-81