aiguière à ablutions
terme associe: T69-1136
terme associe: T69-3890
terme associe: T69-7039
created: 2012-05-16T00:00:00+02:00
modified: 2014-11-27T11:15:50+01:00
status: 1
type: Concept
alternative label: aiguière d'évêque
broader: T69-1359
definition: Récipient en forme d'aiguière utilisé par les célébrants pour verser l'eau des ablutions lors des messes pontificales et de certaines cérémonies liturgiques (Cendres, Rameaux, lavement des pieds le Jeudi saint, baptême). Elle s'accompagne généralement d'un bassin à ablutions.
in scheme: T69
preferred label: ablution ewers @en-us
preferred label: brocca per l'abluzione @it
preferred label: gomil de abluções @pt
related: T69-1136
related: T69-3890
related: T69-7039