réchaud à charbon liturgique
terme associe: T69-3188
terme associe: T69-4533
created: 2012-05-16T00:00:00+02:00
modified: 2014-11-27T11:51:03+01:00
status: 1
type: Concept
alternative label: berceau à charbon liturgique
alternative label: brasero d'église
alternative label: pincettes à charbon pour l'encens
alternative label: trépied à feu liturgique
broader: T69-1359
definition: Récipient, souvent à trois pieds ou posé sur un trépied plus ou moins haut, permettant d'allumer les braises nécessaires à l'encensement et à allumer le cierge pascal, lors de la liturgie du Samedi saint. Il s'accompagne de pincettes à charbon pour l'encens et d'une pelle à charbon.
in scheme: T69
preferred label: liturgical braziers @en-us
preferred label: braciere liturgico @it
preferred label: fogareiro litúrgico @pt
related: T69-3188
related: T69-4533