seau à eau bénite
terme associe: T69-1136
terme associe: T69-703
terme associe: T69-921
created: 2012-05-16T00:00:00+02:00
modified: 2014-11-27T11:56:48+01:00
status: 1
type: Concept
alternative label: bénitier portatif
alternative label: seau à aspersion
alternative label: situle
broader: T69-1359
definition: Récipient contenant l'eau bénite utilisée pour les aspersions rituelles. A fond plat ou sur un pied bas, il est muni d'une anse mobile sur le dessus et comporte généralement une doublure intérieure amovible. Il s'accompagne toujours d'un aspersoir. Au Moyen Age, il est en général de grandes dimensions, de forme tronconique et porte le nom de situle.
in scheme: T69
narrow match: cb15974042r
preferred label: aspersoriums (liturgical vessels) @en-us
preferred label: secchiello per l'acqua benedetta @it
preferred label: caldeirinha de água benta @pt
related: T69-1136
related: T69-703
related: T69-921