croix du Vendredi saint
terme associe: T69-1645
terme associe: T69-1722
terme associe: T69-2295
created: 2012-05-16T00:00:00+02:00
modified: 2014-12-01T11:19:25+01:00
status: 1
type: Concept
broad match: http://vocab.getty.edu/aat/300235443
broader: T69-1428
definition: Croix, généralement de taille importante, souvent noire et sans crucifix, que l'on pose au sol, sur le coussin du Vendredi saint, lors de la cérémonie de l'adoration de la croix qui a lieu ce jour-là. Il s'agit parfois d'une croix-reliquaire.
in scheme: T69
preferred label: Good Friday crosses @en-us
preferred label: croce del Venerdì santo @it
preferred label: cruz de Sexta-feira Santa @pt
related: T69-1645
related: T69-1722
related: T69-2295