service de cérémonie de la Porte sainte
created: 2012-05-16T00:00:00+02:00
modified: 2014-11-27T16:04:01+01:00
status: 1
type: Concept
alternative label: marteau de la Porte sainte
alternative label: plat de la Porte sainte
alternative label: truelle de la Porte sainte
broad match: cb11936841q
broad match: Porte Sainte
broad match: http://vocab.getty.edu/aat/300133146
broader: T69-1449
definition: Ensemble d'instruments utilisés par le pape ou par de hauts dignitaires ecclésiastiques comme les cardinaux pénitenciers, lors des cérémonies d'ouverture et de clôture de la Porte sainte des basiliques jubilaires romaines. Le service de cérémonie de la Porte sainte comprend un marteau (marteau de la Porte sainte) et une truelle (truelle de la Porte sainte), éventuellement accompagnés d'un plat (plat de la Porte sainte). Le service d'honneur qu'utilise le pape est en or ou en argent.
in scheme: T69
preferred label: Porta Santa ceremony services @en-us
preferred label: servizio cerimoniale per la Porta Santa @it
preferred label: serviço do cerimonial da Porta Santa @pt