boîte de croix
terme associe: T69-1645
created: 2012-05-16T00:00:00+02:00
modified: 2014-11-26T12:28:40+01:00
status: 1
type: Concept
alternative label: boîte à croix
alternative label: écrin de croix
alternative label: étui de croix
broad match: http://vocab.getty.edu/aat/300235443
broader: T69-1465
definition: Coffret dans lequel est conservée une croix.
in scheme: T69
preferred label: cross boxes @en-us
preferred label: custodia di croce @it
preferred label: estojo de cruz @pt
related: T69-1645