coffret pour le viatique
terme associe: T69-1214
terme associe: T69-1298
terme associe: T69-2228
created: 2012-05-16T00:00:00+02:00
modified: 2014-11-26T12:34:51+01:00
status: 1
type: Concept
alternative label: boîte d'administration
alternative label: cassette du viatique
alternative label: nécessaire pour la communion des malades
broad match: cb13162914n
broader: T69-1465
definition: Valise ou boîte utilisée pour porter les objets et linges nécessaires à l'administration du viatique et de l'extrême-onction (ciboire des malades, ampoule à huile des malades, corporal, étole de viatique, etc.).
in scheme: T69
preferred label: Viaticum cases @en-us
preferred label: cofanetto per il servizio da viatico @it
preferred label: porta-viático @pt
related: T69-1214
related: T69-1298
related: T69-2228