étui à chapelet
terme associe: T69-1620
created: 2012-05-16T00:00:00+02:00
modified: 2014-11-26T12:36:08+01:00
status: 1
type: Concept
alternative label: boîte à chapelet
alternative label: œuf à chapelet
broad match: http://data.bnf.fr/ark:/12148/cb120061632
broad match: http://vocab.getty.edu/aat/300264662
broader: T69-1465
definition: Petit sac de cuir ou d'étoffe, ou boîte souvent de forme sphérique (œuf à chapelet), dans lequel on range un chapelet.
in scheme: T69
preferred label: chaplet cases @en-us
preferred label: custodia per la corona del rosario @it
preferred label: estojo de terço @pt
related: T69-1620