étui de livre liturgique
created: 2012-05-16T00:00:00+02:00
modified: 2014-11-26T12:36:42+01:00
status: 1
type: Concept
alternative label: boîte d'évangéliaire
alternative label: boîte de livre liturgique
alternative label: boîte de missel
broader: T69-1465
definition: Boîte, généralement en cuir ou en carton recouvert de tissu, utilisée pour conserver un livre liturgique dont la reliure est particulièrement précieuse ou fragile.
in scheme: T69
preferred label: liturgical book boxes @en-us
preferred label: custodia di libro liturgico @it
preferred label: tachim @pt