objet funéraire
terme associe: T69-377
terme associe: T69-926
created: 2012-05-16T00:00:00+02:00
modified: 2014-11-27T10:43:31+01:00
status: 1
type: Concept
alternative label: fond d'or
alternative label: fond de coupe
broad match: http://vocab.getty.edu/aat/300234126
broader: T69-1114
definition: Objet, vase sacré, instrument ou récipient utilisé dans le cadre des rites funéraires.
in scheme: T69
narrower: T69-1521
narrower: T69-1524
narrower: T69-1526
narrower: T69-1530
narrower: T69-1535
narrower: T69-1538
narrower: T69-1542
narrower: T69-1544
narrower: T69-1549
narrower: T69-1551
preferred label: funerary objects @en-us
preferred label: oggetti funerari @it
preferred label: objectos funerários @pt
related: T69-377
related: T69-926