boîte à crâne
created: 2012-05-16T00:00:00+02:00
modified: 2014-11-27T10:50:51+01:00
status: 1
type: Concept
alternative label: maison à crâne
broad match: http://vocab.getty.edu/aat/300197579
broader: T69-1520
definition: Boîte généralement en bois dans laquelle on plaçait le crâne d'un défunt pour le conserver à la vue, au moment où l'on déposait son squelette dans un ossuaire. Elle présente souvent une ouverture à sa partie antérieure pour laisser voir le crâne. Elle est peinte de motifs et de couleurs funéraires et porte une inscription donnant le nom du mort, la date de son décès, parfois son âge et diverses invocations.
in scheme: T69
preferred label: skull urns @en-us
preferred label: urna del teschio @it
preferred label: caixa de crânio @pt
scope note: Ne pas confondre avec le reliquaire de crâne.