calice funéraire
terme associe: T69-1551
created: 2012-05-16T00:00:00+02:00
modified: 2014-11-27T10:51:58+01:00
status: 1
type: Concept
broader: T69-1520
definition: Calice non consacré, en matériaux non précieux et sans dorure intérieure, destiné à être déposé dans une tombe d'ecclésiastique et non pas à être utilisé pour l'Eucharistie.
in scheme: T69
preferred label: tomb chalices @en-us
preferred label: calice funerario @it
preferred label: cálice funerário @pt
related: T69-1551