cierge funéraire
terme associe: T69-1808
created: 2012-05-16T00:00:00+02:00
modified: 2014-11-27T10:53:30+01:00
status: 1
type: Concept
alternative label: cierge d'honneur
broad match: http://data.bnf.fr/ark:/12148/cb119367105
broader: T69-1520
definition: Chandelle mise en forme de façon décorative, déposée et allumée sur le cercueil ou portée autour de lui pendant une cérémonie funéraire ou encore allumée sur la tombe après l'inhumation. Le cierge funéraire peut être en forme de croix et porter un crucifix, être peint de motifs aux couleurs funéraires, être entouré d'un ruban noir, des armoiries du défunt, etc.
in scheme: T69
preferred label: funeral candles @en-us
preferred label: cero funebre @it
preferred label: círio fúnebre @pt
related: T69-1808