cire de deuil
terme associe: T69-1808
created: 2012-05-16T00:00:00+02:00
modified: 2014-11-27T10:54:31+01:00
status: 1
type: Concept
alternative label: cire funéraire
broad match: http://data.bnf.fr/ark:/12148/cb119367105
broad match: http://vocab.getty.edu/aat/300234126
broader: T69-1520
definition: Fine chandelle mise en forme de façon décorative, déposée et allumée pendant toute la période du deuil à la place qu'occupait un défunt à l'intérieur d'une église. Elle peut être décorée et disposée dans une petite corbeille ou sur un petit plateau.
in scheme: T69
preferred label: mourning candles @en-us
preferred label: cero del lutto @it
preferred label: círio de luto @pt
related: T69-1808