couronne mortuaire
terme associe: T69-1542
terme associe: T69-946
created: 2012-05-16T00:00:00+02:00
modified: 2014-11-27T10:59:47+01:00
status: 1
type: Concept
alternative label: couronne funéraire
broader: T69-1520
definition: Cercle ornemental fait de fleurs et de feuillages naturels ou artificiels que l'on dépose sur une tombe, qui comporte généralement un ruban portant une inscription dédicatoire.
in scheme: T69
preferred label: funeral wreaths @en-us
preferred label: corona funebre @it
preferred label: coroa funerária @pt
related: T69-1542
related: T69-946