croix funéraire de vêtement
created: 2012-05-16T00:00:00+02:00
modified: 2014-11-27T11:01:28+01:00
status: 1
type: Concept
alternative label: croix funéraire objet
alternative label: petite croix funéraire
broad match: cb12647480k
broader: T69-1520
definition: Petite croix constituée de lamelles d'or ou de métal doré, parfois sur une âme de bois placée, dans le cercueil ou le sarcophage d'un défunt, généralement cousue sur ses vêtements. Il s'agit habituellement d'une croix grecque dotée de petits trous sur le pourtour pour pouvoir être cousue.
in scheme: T69
preferred label: funerary vestment crosses @en-us
preferred label: crocetta bratteata @it
preferred label: cruzinha funerária @pt