croix mortuaire
terme associe: T69-1535
terme associe: T69-946
created: 2012-05-16T00:00:00+02:00
modified: 2014-10-21T10:08:15+02:00
status: 1
type: Concept
broad match: cb12647480k
broad match: Croix (christianisme)
broad match: http://vocab.getty.edu/aat/300235443
broader: T69-1520
definition: Croix de fleurs et de feuillages naturels ou artificiels (céramique, perles de verre, etc.) que l'on dépose sur une tombe, parfois complétée par un ruban portant une inscription dédicatoire.
in scheme: T69
related: T69-1535
related: T69-946