diptyque commémoratif
created: 2012-05-16T00:00:00+02:00
modified: 2014-11-27T11:03:47+01:00
status: 1
type: Concept
broader: T69-1520
definition: Paire de petits panneaux, généralement en ivoire ou en os, attachés ensemble au moyen de charnières. Il est décoré, à l'extérieur, de scènes ou de figures religieuses, et porte à l'intérieur une liste de noms de personnes à lire pendant la messe, lors de la prière d'intercession pour les vivants et les morts.
in scheme: T69
preferred label: commemorative diptychs @en-us
preferred label: dittico commemorativo @it
preferred label: díptico comemorativo @pt