lacrymatoire
created: 2012-05-16T00:00:00+02:00
modified: 2014-11-27T11:05:12+01:00
status: 1
type: Concept
broad match: http://data.bnf.fr/ark:/12148/cb13601651d
broad match: http://vocab.getty.edu/aat/300234126
broader: T69-1520
definition: Fiole de verre ou d'albâtre servant à contenir un liquide ou des onguents parfumés que l'on déposait dans les sépultures, à la fin de l'Antiquité et au haut Moyen Age.
in scheme: T69
preferred label: lachrymatories @en-us
preferred label: lacrimatorio @it
preferred label: lacrimatório @pt