patène funéraire
terme associe: T69-1269
terme associe: T69-1524
created: 2012-05-16T00:00:00+02:00
modified: 2014-11-27T11:06:53+01:00
status: 1
type: Concept
broader: T69-1520
definition: Patène non consacrée, en matériaux non précieux et sans dorure intérieure, destinée à être déposée dans la tombe d'un ecclésiastique et non à être utilisée pour l'Eucharistie.
in scheme: T69
preferred label: tomb patens @en-us
preferred label: patena funeraria @it
preferred label: patena funerária @pt
related: T69-1269
related: T69-1524