baudrier pour instruments de procession
created: 2012-05-16T00:00:00+02:00
modified: 2014-11-27T16:18:23+01:00
status: 1
type: Concept
broad match: cb11949807g
broad match: http://vocab.getty.edu/aat/300210002
broader: T69-1557
definition: Support, constitué d'une gaine fixée à une ceinture, utilisé lors des processions pour porter tout élément de mobilier liturgique comportant une hampe.
in scheme: T69
preferred label: belts for processional instruments @en-us
preferred label: bossolo per arredi processionali @it
preferred label: cinturão para instrumentos processionais @pt