cierge de procession
terme associe: T69-1582
terme associe: T69-1808
created: 2012-05-16T00:00:00+02:00
modified: 2014-11-28T12:18:11+01:00
status: 1
type: Concept
broader: T69-1557
definition: Cierge porté en procession. Il peut être décoré et porter un panonceau de cierge.
in scheme: T69
preferred label: processional candles @en-us
preferred label: cero processionale @it
preferred label: círio processional @pt
related: T69-1582
related: T69-1808