croix de confrérie
terme associe: T69-2380
created: 2012-05-16T00:00:00+02:00
modified: 2014-11-28T12:21:33+01:00
status: 1
type: Concept
broad match: http://vocab.getty.edu/aat/300235443
broader: T69-1557
definition: Croix portée lors de processions par un membre d'une confrérie. Elle se distingue souvent de la croix de procession par une bande d'étoffe drapée autour des branches ou accrochée à la hampe (écharpe de croix de confrérie).
in scheme: T69
preferred label: confraternity crosses @en-us
preferred label: croce di confraternita @it
preferred label: cruz de confraria @pt
related: T69-2380