croix de pénitent
created: 2012-05-16T00:00:00+02:00
modified: 2014-11-28T12:32:21+01:00
status: 1
type: Concept
broader: T69-1557
definition: Grande croix nue, portée en procession sur l'épaule, par un ou plusieurs pénitents, lors de la Semaine sainte.
in scheme: T69
preferred label: penitential crosses @en-us
preferred label: croce penitenziale @it
preferred label: cruz de penitente @pt