croix de procession
terme associe: T69-1145
terme associe: T69-1645
terme associe: T69-1838
created: 2012-05-16T00:00:00+02:00
modified: 2014-11-28T12:35:47+01:00
status: 1
type: Concept
broader: T69-1557
definition: Croix utilisée lors des processions ou des enterrements portant généralement le Christ sur la face et parfois la Vierge ou un saint au revers. La croix s'emboîte habituellement sur une hampe. Elle peut comporter des représentations de saint Jean et de la Vierge sur des supports particuliers, des clochettes et un nœud à la base. Fichée sur un pied, elle peut aussi, servir de croix d'autel.
in scheme: T69
preferred label: processional crosses @en-us
preferred label: croce processionale @it
preferred label: cruz processional @pt
related: T69-1145
related: T69-1645
related: T69-1838