insigne de confrérie
created: 2012-05-16T00:00:00+02:00
modified: 2014-11-28T12:45:19+01:00
status: 1
type: Concept
broader: T69-1557
definition: Emblème, souvent en forme de médaillon, que les membres d'une confrérie portent, lors des processions, autour du cou ou appliqué sur leurs vêtements. Il représente généralement le saint patron ou le symbole de la confrérie.
in scheme: T69
preferred label: confraternity badges @en-us
preferred label: emblema di confraternita @it
preferred label: insígnia de confraria @pt