objet de dévotion
terme associe: T69-426
created: 2012-05-16T00:00:00+02:00
modified: 2015-10-28T15:24:23+01:00
status: 1
type: Concept
alternative label: buis bénit
alternative label: clef de saint Pierre
alternative label: estoc pontifical
alternative label: rameau bénit
alternative label: roue de cire votive
broader: T69-1114
definition: Objet bénit ou commémoratif suscitant la dévotion des fidèles ou lié à leurs pratiques privées en l’honneur de Dieu et des saints.
in scheme: T69
narrower: T69-1593
narrower: T69-1595
narrower: T69-1603
narrower: T69-1607
narrower: T69-1613
narrower: T69-1616
narrower: T69-1620
narrower: T69-1628
narrower: T69-1634
narrower: T69-1640
narrower: T69-1645
narrower: T69-1655
narrower: T69-1656
narrower: T69-1658
narrower: T69-1666
narrower: T69-1667
narrower: T69-1670
narrower: T69-1672
narrower: T69-1683
narrower: T69-1685
narrower: T69-1687
narrower: T69-1689
narrower: T69-1691
narrower: T69-1694
narrower: T69-1713
narrower: T69-1757
narrower: T69-1759
narrower: T69-1761
preferred label: devotional objects @en-us
preferred label: oggetti devozionali @it
preferred label: objectos de devoção @pt
related: T69-426