agnus Dei
terme associe: T69-1683
created: 2012-05-16T00:00:00+02:00
modified: 2014-11-26T14:16:42+01:00
status: 1
type: Concept
alternative label: boîte à agnus-Dei
alternative label: médaillon à agnus-Dei
alternative label: reliquaire à agnus-Dei
broader: T69-1592
definition: Médaillon en cire blanche béni par le pape et distribué à Rome fabriqué à partir des cierges pascals des basiliques romaines ou des cierges offerts au souverain pontife. Il porte sur l'avers la représentation de l'Agneau pascal avec le nom du pape et l'année du règne et au revers des figures de saints ou les armoiries du pape.
in scheme: T69
preferred label: Agnus Deis (medallions) @en-us
preferred label: agnus-Dei @pt
related: T69-1683