attribut d'image sacrée
terme associe: T69-1655
created: 2012-05-16T00:00:00+02:00
modified: 2014-11-26T14:18:57+01:00
status: 1
type: Concept
alternative label: auréole de dévotion
alternative label: auréole de statue
alternative label: auréole de tableau
alternative label: nimbe de dévotion
alternative label: parement d'icône
alternative label: parement d'image pieuse
alternative label: parement d'image sacrée
alternative label: parement de tableau
alternative label: parure d'image sacrée
alternative label: parure de sculpture
alternative label: parure de statue
alternative label: parure de tableau
alternative label: revêtement d'image sacrée
alternative label: sceptre d'image sacrée
broad match: cb12233110q
broad match: Objets du culte catholique
broad match: http://vocab.getty.edu/aat/300234144
broader: T69-1592
definition: Objet, souvent en métal, représentant un ou plusieurs attributs iconographiques (sceptre, etc.), appliqué sur une image sacrée qu'il contribue à caractériser ou porté par celle-ci comme protection ou en signe de révérence.
in scheme: T69
narrower: T69-1704
narrower: T69-1706
narrower: T69-1708
preferred label: attributes of a sacred image @en-us
preferred label: attributo iconografico di immagine sacra @it
preferred label: atributo de imagem sagrada @pt
related: T69-1655