baiser de paix
created: 2012-05-16T00:00:00+02:00
modified: 2015-01-27T11:15:39+01:00
status: 1
type: Concept
alternative label: instrument de paix
alternative label: osculatoire
broad match: cb12233110q
broader: T69-1592
definition: Plaque habituellement en métal, portant une représentation religieuse, que les fidèles et parfois le célébrant embrassent en signe de paix pendant la messe. Elle porte au dos une petite poignée qui permet de l'exposer verticalement.
in scheme: T69
preferred label: paxes @en-us
preferred label: pace @it
preferred label: porta-paz @pt