bénitier d'applique
created: 2012-05-16T00:00:00+02:00
modified: 2014-11-26T14:44:34+01:00
status: 1
type: Concept
alternative label: bénitier d'objet
alternative label: bénitier de chevet
alternative label: bénitier de dévotion
alternative label: bénitier domestique
broader: T69-1592
definition: Petite vasque appliquée et accrochée au mur ou à un meuble, utilisée dans une sacristie ou chez un particulier.
in scheme: T69
preferred label: wall-stoups @en-us
preferred label: acquasanteria pensile @it
preferred label: piazinha de água benta @pt