bouteille à eau bénite
created: 2012-05-16T00:00:00+02:00
modified: 2014-11-26T14:46:02+01:00
status: 1
type: Concept
alternative label: bouteille à eau de Pâques
broader: T69-1592
definition: Bouteille servant de réserve à eau bénite pour un usage domestique. Lorsqu'il s'agit d'une simple bouteille remplie d'eau de source, le matin de Pâques à l'aube, en signe de renouveau, on l'appelle bouteille à eau de Pâques. Elle peut être décorée d'une croix.
in scheme: T69
preferred label: bottles for holy water @en-us
preferred label: bottiglia per l'acqua benedetta @it
preferred label: garrafa de água benta @pt