bouteille-calvaire
created: 2012-05-16T00:00:00+02:00
modified: 2014-11-26T14:48:30+01:00
status: 1
type: Concept
alternative label: bouteille de la Passion
alternative label: croix de marinier
broader: T69-1592
definition: Bouteille en verre qui contient une représentation du Christ en croix, du Calvaire ou des instruments de la Passion.
in scheme: T69
preferred label: bottles with enclosed Calvary @en-us
preferred label: bottiglia del Calvario @it
preferred label: garrafa-calvário @pt