chapelet
terme associe: T69-1511
created: 2012-05-16T00:00:00+02:00
modified: 2014-11-26T14:51:14+01:00
status: 1
type: Concept
alternative label: bague chapelet
alternative label: dizainier
alternative label: rosaire
broader: T69-1592
definition: Instrument de dévotion fait de grains disposés sur une chaîne ou un fil fermé, généralement organisés en cinq séries de dix petits grains (dizaines) séparées par un plus gros. A cette boucle, est suspendue une autre série de trois petits grains entourés de deux gros et terminée par une croix.
in scheme: T69
preferred label: chaplets (rosaries) @en-us
preferred label: corona del rosario @it
preferred label: terço @pt
related: T69-1511