chemin de croix
created: 2012-05-16T00:00:00+02:00
modified: 2014-11-26T15:13:17+01:00
status: 1
type: Concept
alternative label: chemin de la croix
alternative label: station de chemin de croix
preferred label: via crucis
broader: T69-1592
definition: Ensemble de tableaux, de reliefs ou de croix, comportant généralement 14 stations, présenté dans une église et illustrant les scènes du chemin parcouru par le Christ vers le Calvaire.
in scheme: T69
preferred label: ways of the cross @en-us
preferred label: via sacra @pt