croix
terme associe: T69-1142
terme associe: T69-1443
terme associe: T69-1487
terme associe: T69-1573
terme associe: T69-1575
terme associe: T69-1722
terme associe: T69-1851
terme associe: T69-747
terme associe: T69-764
created: 2012-05-16T00:00:00+02:00
modified: 2014-11-26T15:46:50+01:00
status: 1
type: Concept
alternative label: croix de baptême
alternative label: croix de chaire à prêcher
alternative label: croix de confessionnal
alternative label: croix de jubé
alternative label: croix de poutre de gloire
alternative label: croix de tempérance
alternative label: crucifix
broader: T69-1592
definition: Le plus souvent en forme de croix latine et portant généralement une représentation du Christ (crucifix), il s’agit du principal symbole de la réligion catholique. Les croix sont placées en maints endroits des églises. Certaines sont réservées à des cérémonies particulières. Elles sont également utilisées pour la dévotion publique ou privée ou encore comme insignes de dignité.
in scheme: T69
narrower: T69-1649
narrower: T69-1651
narrower: T69-6903
preferred label: crosses (visual works) @en-us
preferred label: croce @it
preferred label: cruz @pt
related: T69-1142
related: T69-1443
related: T69-1487
related: T69-1573
related: T69-1575
related: T69-1722
related: T69-1851
related: T69-747
related: T69-764