croix de sacristie
created: 2012-05-16T00:00:00+02:00
modified: 2014-11-26T15:59:47+01:00
status: 1
type: Concept
broader: T69-1645
definition: Croix, généralement placée sur un meuble de la sacristie, munie d'un pied ou fixée au meuble et devant laquelle le clergé s'incline en entrant et en quittant la pièce.
in scheme: T69
preferred label: sacristy crosses @en-us
preferred label: croce di sacrestia @it
preferred label: cruz de sacristia @pt