croix encadrée
created: 2012-05-16T00:00:00+02:00
modified: 2014-11-26T16:03:54+01:00
status: 1
type: Concept
broader: T69-1645
definition: Croix ou Calvaire, placé sur un fond souvent en tissu précieux et encadré, accroché au mur d'une sacristie ou d'une demeure pour la dévotion privée.
in scheme: T69
preferred label: enframed crosses @en-us
preferred label: croce incorniciata @it
preferred label: cruz emoldurada @pt