grain de chapelet
created: 2012-05-16T00:00:00+02:00
modified: 2014-11-26T16:11:42+01:00
status: 1
type: Concept
broader: T69-1592
definition: Objet de dévotion sphérique, ouvrant, ayant la forme d'un gros grain de rosaire, généralement en ivoire ou en bois, décoré à l'extérieur et contenant à l'intérieur une scène religieuse, souvent le Calvaire.
in scheme: T69
preferred label: prayer nuts @en-us
preferred label: grano devozionale @it
preferred label: conta de rezar @pt