image de commémoration
created: 2012-05-16T00:00:00+02:00
modified: 2014-11-26T16:13:55+01:00
status: 1
type: Concept
alternative label: avis de messe
alternative label: canivet
alternative label: image d'ordination
alternative label: image de communion
alternative label: image de jubilé
alternative label: image de piété
alternative label: image mortuaire
alternative label: image pieuse
broader: T69-1592
definition: Image à sujet ou symbole religieux, donnée en commémoration d'un événement personnel à caractère religieux comportant un texte rappelant cet événement, sa date et parfois une prière ou un texte religieux.
in scheme: T69
preferred label: devotional cards @en-us
preferred label: santino @it
preferred label: registo de santo @pt