instruments de la Passion
terme associe: T69-1573
created: 2012-05-16T00:00:00+02:00
modified: 2014-11-26T16:16:54+01:00
status: 1
type: Concept
broader: T69-1592
definition: Reproduction des objets liés à la Passion du Christ (croix, clous, tenailles, marteau, couronne d'épines, lance, colonne, roseau, fouet, éponge, échelle, dés à jouer, tunique, coq, soleil, lune, main, lanterne, etc.) exposés ou portés en procession durant la Semaine sainte.
in scheme: T69
preferred label: instruments of the Passion @en-us
preferred label: strumenti simbolici dellla Passione @it
preferred label: instrumentos da Paixão @pt
related: T69-1573